����1,�{�ݖ�,�s�撬���E�Ԓn,������,�g�C����,�ݒu�t���A,�o�x,�ܓx,���ʂ̕���,�g�C���ւ̗U���H�Ƃ��ē_���u���b�N��~�݂��Ă���,�g�C���̈ʒu���������ňē����Ă���,�˂̌`��,�Ԉ֎q���o����ł���i�o�����̗L������80cm�ȏ�j,�Ԉ֎q���]��ł���i���a150cm�ȏ�̉~�����ڂł���j,�֍��ɔw�����ꂪ����,�֍��Ɏ肷�肪����,�I�X�g���C�g�p�ݔ�������,�I�X�g���C�g�p�ݔ��������Ή����Ă���,��^�x�b�h������Ă���,���c���p���ނ����䓙������Ă���,���c���p�֎q������Ă���,���p�Ăяo���{�^����ݒu���Ă���,���p�ł��鎞�Ԃ́A�ʔN�ς��Ȃ�,���j��,�Ηj��,���j��,�ؗj��,���j��,�y�j��,���j��,�j��,���̑�,�G�߂ɂ���ė��p�\���قȂ�ꍇ�̊���2,���j��2,�Ηj��2,���j��2,�ؗj��2,���j��2,�y�j��2,���j��2,�j��2,���̑�2,�G�߂ɂ���ė��p�\���قȂ�ꍇ�̊���3,���j��3,�Ηj��3,���j��3,�ؗj��3,���j��3,�y�j��3,���j��3,�j��3,�ʐ^�f�[�^�i�g�C���̓�����j,�ʐ^�f�[�^�i�g�C�����j,�ʐ^�f�[�^�i�g�C�����i�ʊp�x�j�j,���l,�f�[�^�̍쐬�N��
�g�C���o���A�t���[�f�[�^,�����}����,�{���s�{�����񒚖�24�Ԓn,,�S�K����ł��g�C��,4F,139.4839035,35.67617055,���p,�~,�~,C.�蓮������,��,��,��,��,�~,�~,�~,��,��,��,��,0900_2200,0900_2200,0900_2200,0900_2200,0900_2200,0900_2200,0900_2200,0900_2200,��1�Ηj��(�x���Əd�Ȃ����ꍇ�́A�����ȍ~�̋x���łȂ������x��)�A ��3���j���Ƃ��̗��� (�x���Əd�Ȃ����ꍇ�́A�����ȍ~�̋x���łȂ������x��)�A �N���N�n (12��29������1��3���܂�) �A���ʐ�����(���̓s�x�L��Ȃǂł��m�点���܂��B)�͋x�قƂȂ邽�߁A���p�ł��܂���B,,,,,,,,,,,,,,,,,,,,http://www.opendata.metro.tokyo.jp/fukushihoken/wc-photos/13206_99_04_001_02_1.jpg,http://www.opendata.metro.tokyo.jp/fukushihoken/wc-photos/13206_99_04_001_02_2.jpg,http://www.opendata.metro.tokyo.jp/fukushihoken/wc-photos/13206_99_04_001_02_3.jpg,,�ߘa3�N7������
�g�C���o���A�t���[�f�[�^,�����}����,�{���s�{�����񒚖�24�Ԓn,,�R�K����ł��g�C��,3F,139.4837675,35.67618072,���p,�~,�~,C.�蓮������,��,��,��,��,��,�~,�~,��,��,��,��,0900_2200,0900_2200,0900_2200,0900_2200,0900_2200,0900_2200,0900_2200,0900_2200,��1�Ηj��(�x���Əd�Ȃ����ꍇ�́A�����ȍ~�̋x���łȂ������x��)�A ��3���j���Ƃ��̗��� (�x���Əd�Ȃ����ꍇ�́A�����ȍ~�̋x���łȂ������x��)�A �N���N�n (12��29������1��3���܂�) �A���ʐ�����(���̓s�x�L��Ȃǂł��m�点���܂��B)�͋x�قƂȂ邽�߁A���p�ł��܂���B,,,,,,,,,,,,,,,,,,,,http://www.opendata.metro.tokyo.jp/fukushihoken/wc-photos/13206_99_04_001_01_1.jpg,http://www.opendata.metro.tokyo.jp/fukushihoken/wc-photos/13206_99_04_001_01_2.jpg,http://www.opendata.metro.tokyo.jp/fukushihoken/wc-photos/13206_99_04_001_01_3.jpg,,�ߘa3�N7������
�g�C���o���A�t���[�f�[�^,�����}����,�{���s�{�����񒚖�24�Ԓn,,�T�K����ł��g�C��,5F,139.4837452,35.67585322,���p,�~,�~,C.�蓮������,��,��,��,��,�~,�~,�~,��,��,��,��,0900_2200,0900_2200,0900_2200,0900_2200,0900_2200,0900_2200,0900_2200,0900_2200,��1�Ηj��(�x���Əd�Ȃ����ꍇ�́A�����ȍ~�̋x���łȂ������x��)�A ��3���j���Ƃ��̗��� (�x���Əd�Ȃ����ꍇ�́A�����ȍ~�̋x���łȂ������x��)�A �N���N�n (12��29������1��3���܂�) �A���ʐ�����(���̓s�x�L��Ȃǂł��m�点���܂��B)�͋x�قƂȂ邽�߁A���p�ł��܂���B,,,,,,,,,,,,,,,,,,,,http://www.opendata.metro.tokyo.jp/fukushihoken/wc-photos/13206_99_04_001_03_1.jpg,http://www.opendata.metro.tokyo.jp/fukushihoken/wc-photos/13206_99_04_001_03_2.jpg,http://www.opendata.metro.tokyo.jp/fukushihoken/wc-photos/13206_99_04_001_03_3.jpg,,�ߘa3�N7������
�g�C���o���A�t���[�f�[�^,���{�w�k���O�g�C��,�{���s���{���꒚��4�Ԓn�O,,���@�\�g�C��,1F,139.457353,35.67082997,���p,�~,�~,A.���������ˁi�����{�^���j,��,��,��,��,��,��,��,��,��,��,��,0000_2359,0000_2359,0000_2359,0000_2359,0000_2359,0000_2359,0000_2359,0000_2359,,,,,,,,,,,,,,,,,,,,,http://www.opendata.metro.tokyo.jp/fukushihoken/wc-photos/13206_99_08_001_01_1.jpg,http://www.opendata.metro.tokyo.jp/fukushihoken/wc-photos/13206_99_08_001_01_2.jpg,http://www.opendata.metro.tokyo.jp/fukushihoken/wc-photos/13206_99_08_001_01_3.jpg,,�ߘa3�N7������
�g�C���o���A�t���[�f�[�^,�{���w�����O�g�C��,�{���s�{���꒚��1��1��,,�{���w������ł��g�C��,1F,139.479375,35.67225397,���p,�~,�~,A.���������ˁi�����{�^���j,��,��,��,��,��,��,��,��,��,��,��,0000_2359,0000_2359,0000_2359,0000_2359,0000_2359,0000_2359,0000_2359,0000_2359,,,,,,,,,,,,,,,,,,,,,http://www.opendata.metro.tokyo.jp/fukushihoken/wc-photos/13206_99_08_002_01_1.jpg,http://www.opendata.metro.tokyo.jp/fukushihoken/wc-photos/13206_99_08_002_01_2.jpg,http://www.opendata.metro.tokyo.jp/fukushihoken/wc-photos/13206_99_08_002_01_3.jpg,,�ߘa3�N7������
�g�C���o���A�t���[�f�[�^,������쒬����,�{���s�쒬�l����40��39��,,������쒬��������ł��g�C��,1F,139.464083,35.65489297,���p,�~,�~,C.�蓮������,��,�~,�~,��,�~,�~,�~,�~,�~,��,��,0000_2359,0000_2359,0000_2359,0000_2359,0000_2359,0000_2359,0000_2359,0000_2359,,,,,,,,,,,,,,,,,,,,,http://www.opendata.metro.tokyo.jp/fukushihoken/wc-photos/13206_99_07_007_01_1.jpg,http://www.opendata.metro.tokyo.jp/fukushihoken/wc-photos/13206_99_07_007_01_2.jpg,http://www.opendata.metro.tokyo.jp/fukushihoken/wc-photos/13206_99_07_007_01_3.jpg,,�ߘa3�N7������
�g�C���o���A�t���[�f�[�^,�{���s���p��,�{���s��Ԓ��꒚��3�Ԓn,,1�K��������ł��g�C��,1F,139.4919,35.67865097,���p,�~,�~,A.���������ˁi�����{�^���j,��,��,��,��,��,��,��,��,��,��,��,,1000_1700,1000_1700,1000_1700,1000_1700,1000_1700,1000_1700,1000_1700,���j��(�x�ٓ��j���J�ٓ��̏ꍇ�́A���p��,,,,,,,,,,,,,,,,,,,,http://www.opendata.metro.tokyo.jp/fukushihoken/wc-photos/13206_99_05_024_01_1.jpg,http://www.opendata.metro.tokyo.jp/fukushihoken/wc-photos/13206_99_05_024_01_2.jpg,http://www.opendata.metro.tokyo.jp/fukushihoken/wc-photos/13206_99_05_024_01_3.jpg,,�ߘa3�N7������
�g�C���o���A�t���[�f�[�^,�{���s���p��,�{���s��Ԓ��꒚��3�Ԓn,,2�K���r�[�k������ł��g�C��,2F,139.492032,35.67896197,���p,�~,�~,A.���������ˁi�����{�^���j,��,��,��,��,�~,�~,�~,��,��,��,��,,1000_1700,1000_1700,1000_1700,1000_1700,1000_1700,1000_1700,1000_1700,���j���i�x�ٓ��j���J�ٓ��̏ꍇ�́A���p��,,,,,,,,,,,,,,,,,,,,http://www.opendata.metro.tokyo.jp/fukushihoken/wc-photos/13206_99_05_024_02_1.jpg,http://www.opendata.metro.tokyo.jp/fukushihoken/wc-photos/13206_99_05_024_02_2.jpg,http://www.opendata.metro.tokyo.jp/fukushihoken/wc-photos/13206_99_05_024_02_3.jpg,,�ߘa3�N7������
�g�C���o���A�t���[�f�[�^,���ˍ��L��,�{���s�����Z����27��66��,,���ˍ��L�ꂾ��ł��g�C��,1F,139.479556,35.65533998,���p,�~,�~,C.�蓮������,��,�~,�~,��,��,�~,�~,��,��,��,��,0000_2359,0000_2359,0000_2359,0000_2359,0000_2359,0000_2359,0000_2359,0000_2359,,,,,,,,,,,,,,,,,,,,,http://www.opendata.metro.tokyo.jp/fukushihoken/wc-photos/13206_99_07_002_01_1.jpg,http://www.opendata.metro.tokyo.jp/fukushihoken/wc-photos/13206_99_07_002_01_2.jpg,http://www.opendata.metro.tokyo.jp/fukushihoken/wc-photos/13206_99_07_002_01_3.jpg,,�ߘa3�N7������
�g�C���o���A�t���[�f�[�^,�������S���ڌ���,�{���s�������l����22�Ԓn,,�������S���ڌ�������ł��g�C��,1F,139.454461,35.68451897,���p,�~,�~,C.�蓮������,��,��,�~,��,��,�~,�~,��,��,��,��,0000_2359,0000_2359,0000_2359,0000_2359,0000_2359,0000_2359,0000_2359,0000_2359,,,,,,,,,,,,,,,,,,,,,http://www.opendata.metro.tokyo.jp/fukushihoken/wc-photos/13206_99_07_011_01_1.jpg,http://www.opendata.metro.tokyo.jp/fukushihoken/wc-photos/13206_99_07_011_01_2.jpg,http://www.opendata.metro.tokyo.jp/fukushihoken/wc-photos/13206_99_07_011_01_3.jpg,,�ߘa3�N7������
�g�C���o���A�t���[�f�[�^,�{���s������Z���^�[,�{���s�{�����꒚��32�Ԓn,,1�K����ł��g�C��,1F,139.479504,35.67662397,���p,�~,�~,A.���������ˁi�����{�^���j,��,��,�~,��,�~,�~,�~,�~,�~,��,��,0830_1700,0830_1700,0830_1700,0830_1700,0830_1700,,,,�y���y�і�Ԃ͋���Z���^�[��c�����p�҂����鎞�ԑт̂ݕs����ɊJ���Ă��邽�ߗ��p�\���Ԃɂ͓���Ă��܂���B,,,,,,,,,,,,,,,,,,,,http://www.opendata.metro.tokyo.jp/fukushihoken/wc-photos/13206_99_05_001_01_1.jpg,http://www.opendata.metro.tokyo.jp/fukushihoken/wc-photos/13206_99_05_001_01_2.jpg,http://www.opendata.metro.tokyo.jp/fukushihoken/wc-photos/13206_99_05_001_01_3.jpg,,�ߘa3�N7������
�g�C���o���A�t���[�f�[�^,�s�������Z���^�[�v���b�c,�{���꒚��100�Ԓn,���E�V�[�j��5F�A6F,���E�V�[�j��5F����ł��g�C��,5F,139.4795136,35.67202958,���p,�~,�~,C.�蓮������,��,��,��,��,��,��,��,��,��,��,��,0830_2200,0830_2200,0830_2200,0830_2200,0830_2200,0830_2200,0830_2200,0830_2200,�t�B�b�e�B���O�{�[�h�i���ւ���j����A��َ��Ԃɏ�����,,,,,,,,,,,,,,,,,,,,,,,,�ߘa3�N7������
�g�C���o���A�t���[�f�[�^,�s�������Z���^�[�v���b�c,�{���꒚��100�Ԓn,���E�V�[�j��5F�A6F,���E�V�[�j��6F����ł��g�C��,6F,139.4794804,35.6720585,���p,�~,�~,C.�蓮������,��,��,��,��,��,��,��,��,��,��,��,0830_2200,0830_2200,0830_2200,0830_2200,0830_2200,0830_2200,0830_2200,0830_2200,�t�B�b�e�B���O�{�[�h�i���ւ���j����A��َ��Ԃɏ�����,,,,,,,,,,,,,,,,,,,,,,,,�ߘa3�N7������
�g�C���o���A�t���[�f�[�^,�s�������Z���^�[�v���b�c,�{���꒚��100�Ԓn,���E�V�[�j��5F�A6F,���E�V�[�j��5F�o���g�z�[������ł��g�C��,5F,139.4794657,35.6720245,���p,�~,�~,C.�蓮������,��,��,��,��,��,��,��,��,��,��,��,0830_2200,0830_2200,0830_2200,0830_2200,0830_2200,0830_2200,0830_2200,0830_2200,��َ��Ԃɏ�����,,,,,,,,,,,,,,,,,,,,,,,,�ߘa3�N7������
�g�C���o���A�t���[�f�[�^,�{���s���l�J�̈��,�{���s�l�J�ܒ���6�Ԓn,,1�K����ł��g�C��,1F,139.441657,35.66447497,���p,�~,�~,A.���������ˁi�����{�^���j,��,�~,��,��,�~,�~,�~,�~,�~,��,��,0900_2100,0900_2100,0900_2100,0900_2100,0900_2100,0900_2100,0900_2100,0900_2100,�x�ٓ�������,,,,,,,,,,,,,,,,,,,,http://www.opendata.metro.tokyo.jp/fukushihoken/wc-photos/13206_99_05_017_01_1.jpg,http://www.opendata.metro.tokyo.jp/fukushihoken/wc-photos/13206_99_05_017_01_2.jpg,http://www.opendata.metro.tokyo.jp/fukushihoken/wc-photos/13206_99_05_017_01_3.jpg,,�ߘa3�N7������
�g�C���o���A�t���[�f�[�^,�{���s���T�C�N���v���U,�{���s�l�J�Z����58�Ԓn,,������3�K����ł��g�C��,3F,139.4312461,35.67158336,���p,�~,�~,A.���������ˁi�����{�^���j,��,�~,��,��,��,��,�~,�~,�~,��,��,0900_1600,0900_1600,0900_1600,0900_1600,0900_1600,,,,�N���N�n�i12/29�`1/3�j�͋x�قƂȂ邽�߁A���p�ł��Ȃ�,,,,,,,,,,,,,,,,,,,,http://www.opendata.metro.tokyo.jp/fukushihoken/wc-photos/13206_99_08_003_03_1.jpg,http://www.opendata.metro.tokyo.jp/fukushihoken/wc-photos/13206_99_08_003_03_2.jpg,http://www.opendata.metro.tokyo.jp/fukushihoken/wc-photos/13206_99_08_003_03_3.jpg,,�ߘa3�N7������
�g�C���o���A�t���[�f�[�^,�{���s���T�C�N���v���U,�{���s�l�J�Z����58�Ԓn,,�Ǘ���1�K����ł��g�C��,1F,139.431152,35.67163498,���p,��,�~,A.���������ˁi�����{�^���j,��,�~,�~,��,�~,�~,�~,�~,�~,��,��,0900_1600,0900_1600,0900_1600,0900_1600,0900_1600,,,,�N���N�n�i12/29�`1/3�j�͋x�قƂȂ邽�߁A���p�ł��Ȃ�,,,,,,,,,,,,,,,,,,,,http://www.opendata.metro.tokyo.jp/fukushihoken/wc-photos/13206_99_08_003_01_1.jpg,http://www.opendata.metro.tokyo.jp/fukushihoken/wc-photos/13206_99_08_003_01_2.jpg,http://www.opendata.metro.tokyo.jp/fukushihoken/wc-photos/13206_99_08_003_01_3.jpg,,�ߘa3�N7������
�g�C���o���A�t���[�f�[�^,�{���s���T�C�N���v���U,�{���s�l�J�Z����58�Ԓn,,�Ǘ���2�K����ł��g�C��,2F,139.4312648,35.67172778,���p,�~,�~,A.���������ˁi�����{�^���j,��,�~,�~,��,�~,�~,�~,�~,�~,��,��,0900_1600,0900_1600,0900_1600,0900_1600,0900_1600,,,,�N���N�n�i12/29�`1/3�j�͋x�قƂȂ邽�߁A���p�ł��Ȃ�,,,,,,,,,,,,,,,,,,,,http://www.opendata.metro.tokyo.jp/fukushihoken/wc-photos/13206_99_08_003_02_1.jpg,http://www.opendata.metro.tokyo.jp/fukushihoken/wc-photos/13206_99_08_003_02_2.jpg,http://www.opendata.metro.tokyo.jp/fukushihoken/wc-photos/13206_99_08_003_02_3.jpg,,�ߘa3�N7������
�g�C���o���A�t���[�f�[�^,�V�c����,�{���s���V���l����58�Ԓn,,�V�c��������ł��g�C��,1F,139.44437,35.67180397,���p,��,�~,C.�蓮������,��,�~,��,��,�~,�~,�~,��,�~,��,��,0000_2359,0000_2359,0000_2359,0000_2359,0000_2359,0000_2359,0000_2359,0000_2359,,,,,,,,,,,,,,,,,,,,,http://www.opendata.metro.tokyo.jp/fukushihoken/wc-photos/13206_99_07_010_01_1.jpg,http://www.opendata.metro.tokyo.jp/fukushihoken/wc-photos/13206_99_07_010_01_2.jpg,http://www.opendata.metro.tokyo.jp/fukushihoken/wc-photos/13206_99_07_010_01_3.jpg,,�ߘa3�N7������
�g�C���o���A�t���[�f�[�^,�{���s�������̈��,�{���s��蒬�ܒ���5�Ԓn,,1�K����ł��g�C��,1F,139.477717,35.65583597,���p,�~,�~,A.���������ˁi�����{�^���j,��,�~,�~,��,��,��,�~,�~,�~,��,��,0900_2100,0900_2100,0900_2100,0900_2100,0900_2100,0900_2100,0900_2100,0900_2100,�x�ٓ��i�s����j�͗��p�s��,,,,,,,,,,,,,,,,,,,,http://www.opendata.metro.tokyo.jp/fukushihoken/wc-photos/13206_99_05_015_01_1.jpg,http://www.opendata.metro.tokyo.jp/fukushihoken/wc-photos/13206_99_05_015_01_2.jpg,http://www.opendata.metro.tokyo.jp/fukushihoken/wc-photos/13206_99_05_015_01_3.jpg,�v�����g�A�E�g�����{�̂��߁A�ēx����,�ߘa3�N7������
�g�C���o���A�t���[�f�[�^,�{���s�������̈��,�{���s��蒬�ܒ���5�Ԓn,,�n��1�K����ł��g�C��,B1F,139.4778538,35.65585025,���p,�~,�~,A.���������ˁi�����{�^���j,��,�~,�~,��,��,��,��,�~,��,��,��,0900_2100,0900_2100,0900_2100,0900_2100,0900_2100,0900_2100,0900_2100,0900_2100,�x�ٓ��i�s����j�͗��p�s��,,,,,,,,,,,,,,,,,,,,http://www.opendata.metro.tokyo.jp/fukushihoken/wc-photos/13206_99_05_015_02_1.jpg,http://www.opendata.metro.tokyo.jp/fukushihoken/wc-photos/13206_99_05_015_02_2.jpg,http://www.opendata.metro.tokyo.jp/fukushihoken/wc-photos/13206_99_05_015_02_3.jpg,�v�����g�A�E�g�����{�̂��߁A�ēx����,�ߘa3�N7������
�g�C���o���A�t���[�f�[�^,���y�̐X����,�{���s��蒬�ܒ���5�Ԓn,,���y�̐X��������ł��g�C��,1F,139.476121,35.65543397,���p,�~,�~,C.�蓮������,��,�~,�~,��,��,�~,�~,��,��,��,��,0000_2359,0000_2359,0000_2359,0000_2359,0000_2359,0000_2359,0000_2359,0000_2359,,,,,,,,,,,,,,,,,,,,,http://www.opendata.metro.tokyo.jp/fukushihoken/wc-photos/13206_99_07_003_01_1.jpg,http://www.opendata.metro.tokyo.jp/fukushihoken/wc-photos/13206_99_07_003_01_2.jpg,http://www.opendata.metro.tokyo.jp/fukushihoken/wc-photos/13206_99_07_003_01_3.jpg,,�ߘa3�N7������
�g�C���o���A�t���[�f�[�^,�{���s���y�̐X������,�{���s�쒬�Z����32�Ԓn,,����D����ł��g�C��,1F,139.473126,35.65538697,���p,�~,�~,A.���������ˁi�����{�^���j,��,�~,�~,��,�~,�~,�~,�~,�~,��,��,,0900_1700,0900_1700,0900_1700,0900_1700,0900_1700,0900_1700,0900_1700,���j�����x���ɓ�����ꍇ�͗������x�قƂȂ邽�ߗ��p�ł��Ȃ��ق��A�Վ��x�ٓ��̍ۂ͗��p�ł��Ȃ��B,,,,,,,,,,,,,,,,,,,,http://www.opendata.metro.tokyo.jp/fukushihoken/wc-photos/13206_99_05_002_05_1.jpg,http://www.opendata.metro.tokyo.jp/fukushihoken/wc-photos/13206_99_05_002_05_2.jpg,http://www.opendata.metro.tokyo.jp/fukushihoken/wc-photos/13206_99_05_002_05_3.jpg,,�ߘa3�N7������
�g�C���o���A�t���[�f�[�^,���y�̐X�ό����Y��,�{���s�����Z����32��10��,,���y�̐X�ό����Y��,1F,139.473951,35.65600997,���p,�~,�~,C.�蓮������,��,��,��,��,��,��,�~,��,��,��,��,,1000_1800,1000_1800,1000_1800,1000_1800,1000_1800,1000_1800,1000_1800,,,,,,,,,,,,,,,,,,,,,http://www.opendata.metro.tokyo.jp/fukushihoken/wc-photos/13206_99_05_023_01_1.jpg,http://www.opendata.metro.tokyo.jp/fukushihoken/wc-photos/13206_99_05_023_01_2.jpg,http://www.opendata.metro.tokyo.jp/fukushihoken/wc-photos/13206_99_05_023_01_3.jpg,,�ߘa3�N7������
�g�C���o���A�t���[�f�[�^,�{���s���y�̐X������,�{���s�쒬�Z����32�Ԓn,,����C����ł��g�C��,1F,139.47464,35.65439597,���p,�~,�~,C.�蓮������,��,�~,�~,��,�~,�~,�~,�~,�~,��,��,,0900_1700,0900_1700,0900_1700,0900_1700,0900_1700,0900_1700,0900_1700,���j�����x���ɓ�����ꍇ�͗������x�قƂȂ邽�ߗ��p�ł��Ȃ��ق��A�Վ��x�ٓ��̍ۂ͗��p�ł��Ȃ��B,,,,,,,,,,,,,,,,,,,,http://www.opendata.metro.tokyo.jp/fukushihoken/wc-photos/13206_99_05_002_04_1.jpg,http://www.opendata.metro.tokyo.jp/fukushihoken/wc-photos/13206_99_05_002_04_2.jpg,http://www.opendata.metro.tokyo.jp/fukushihoken/wc-photos/13206_99_05_002_04_3.jpg,,�ߘa3�N7������
�g�C���o���A�t���[�f�[�^,�{���s���y�̐X������,�{���s�쒬�Z����32�Ԓn,,�����₷�炬���P�K����ł��g�C��,1F,139.470794,35.65552197,���p,�~,�~,A.���������ˁi�����{�^���j,��,�~,�~,��,�~,�~,�~,�~,�~,��,��,,0900_1700,0900_1700,0900_1700,0900_1700,0900_1700,0900_1700,0900_1700,���j�����x���ɓ�����ꍇ�͗������x�قƂȂ邽�ߗ��p�ł��Ȃ��ق��A�Վ��x�ٓ��̍ۂ͗��p�ł��Ȃ��B,,,,,,,,,,,,,,,,,,,,http://www.opendata.metro.tokyo.jp/fukushihoken/wc-photos/13206_99_05_002_06_1.jpg,http://www.opendata.metro.tokyo.jp/fukushihoken/wc-photos/13206_99_05_002_06_2.jpg,http://www.opendata.metro.tokyo.jp/fukushihoken/wc-photos/13206_99_05_002_06_3.jpg,,�ߘa3�N7������
�g�C���o���A�t���[�f�[�^,�{���s���y�̐X������,�{���s�쒬�Z����32�Ԓn,,����A����ł��g�C��,1F,139.47196,35.65583997,���p,�~,�~,C.�蓮������,��,�~,�~,��,�~,�~,�~,�~,�~,��,��,,0900_1700,0900_1700,0900_1700,0900_1700,0900_1700,0900_1700,0900_1700,���j�����x���ɓ�����ꍇ�͗������x�قƂȂ邽�ߗ��p�ł��Ȃ��ق��A�Վ��x�ٓ��̍ۂ͗��p�ł��Ȃ��B,,,,,,,,,,,,,,,,,,,,http://www.opendata.metro.tokyo.jp/fukushihoken/wc-photos/13206_99_05_002_03_1.jpg,http://www.opendata.metro.tokyo.jp/fukushihoken/wc-photos/13206_99_05_002_03_2.jpg,http://www.opendata.metro.tokyo.jp/fukushihoken/wc-photos/13206_99_05_002_03_3.jpg,,�ߘa3�N7������
�g�C���o���A�t���[�f�[�^,�{���s���S�g��Q�ҕ����Z���^�[,�{���s�쒬�ܒ���38�Ԓn,�{���s���S�g��Q�ҕ����Z���^�[,�P�K�����g��g�C��,1F,139.4670637,35.65608991,���p,��,�~,A.���������ˁi�����{�^���j,��,��,�~,��,�~,�~,�~,�~,�~,��,��,0900_1700,0900_1900,0900_1700,0900_1900,0900_1700,,,,,,,,,,,,,,,,,,,,,,,,http://www.opendata.metro.tokyo.jp/fukushihoken/wc-photos/13206_99_10_002_02_1.jpg,http://www.opendata.metro.tokyo.jp/fukushihoken/wc-photos/13206_99_10_002_02_2.jpg,http://www.opendata.metro.tokyo.jp/fukushihoken/wc-photos/13206_99_10_002_02_3.jpg,,�ߘa3�N7������
�g�C���o���A�t���[�f�[�^,�{���s���S�g��Q�ҕ����Z���^�[,�{���s�쒬�ܒ���38�Ԓn,�{���s���S�g��Q�ҕ����Z���^�[,�Q�K���ٓ����g��g�C��,2F,139.4669298,35.65612986,���p,��,�~,A.���������ˁi�����{�^���j,��,��,�~,��,�~,�~,�~,�~,�~,��,��,0900_1700,0900_1900,0900_1700,0900_1900,0900_1700,,,,,,,,,,,,,,,,,,,,,,,,http://www.opendata.metro.tokyo.jp/fukushihoken/wc-photos/13206_99_10_002_08_1.jpg,http://www.opendata.metro.tokyo.jp/fukushihoken/wc-photos/13206_99_10_002_08_2.jpg,http://www.opendata.metro.tokyo.jp/fukushihoken/wc-photos/13206_99_10_002_08_3.jpg,,�ߘa3�N7������
�g�C���o���A�t���[�f�[�^,�{���s���S�g��Q�ҕ����Z���^�[,�{���s�쒬�ܒ���38�Ԓn,�{���s���S�g��Q�ҕ����Z���^�[,�P�K�����g��g�C��,1F,139.4667792,35.65607558,���p,�~,�~,E.�蓮�܂��,��,��,�~,��,�~,�~,�~,�~,�~,��,��,0900_1700,0900_1700,0900_1700,0900_1700,0900_1700,,,,��{�͗������p�҂��g�p����g�C���ł�,,,,,,,,,,,,,,,,,,,,http://www.opendata.metro.tokyo.jp/fukushihoken/wc-photos/13206_99_10_002_05_1.jpg,http://www.opendata.metro.tokyo.jp/fukushihoken/wc-photos/13206_99_10_002_05_2.jpg,http://www.opendata.metro.tokyo.jp/fukushihoken/wc-photos/13206_99_10_002_05_3.jpg,,�ߘa3�N7������
�g�C���o���A�t���[�f�[�^,�{���s���S�g��Q�ҕ����Z���^�[,�{���s�쒬�ܒ���38�Ԓn,�{���s���S�g��Q�ҕ����Z���^�[,�v�[���g��g�C��,1F,139.466663,35.65613297,���p,�~,�~,C.�蓮������,��,��,�~,��,�~,�~,�~,�~,�~,��,��,0900_1700,0900_1700,0900_1700,0900_1700,0900_1700,,,,��{�̓v�[�����p�҂��g�p����,,,,,,,,,,,,,,,,,,,,http://www.opendata.metro.tokyo.jp/fukushihoken/wc-photos/13206_99_10_002_06_1.jpg,http://www.opendata.metro.tokyo.jp/fukushihoken/wc-photos/13206_99_10_002_06_2.jpg,http://www.opendata.metro.tokyo.jp/fukushihoken/wc-photos/13206_99_10_002_06_3.jpg,,�ߘa3�N7������
�g�C���o���A�t���[�f�[�^,�{���s���S�g��Q�ҕ����Z���^�[,�{���s�쒬�ܒ���38�Ԓn,�{���s���S�g��Q�ҕ����Z���^�[,�P�K�����g��g�C��,1F,139.4667466,35.65622786,���p,��,�~,A.���������ˁi�����{�^���j,��,��,�~,��,�~,�~,�~,�~,�~,��,��,0900_1700,0900_1900,0900_1700,0900_1900,0900_1700,,,,,,,,,,,,,,,,,,,,,,,,http://www.opendata.metro.tokyo.jp/fukushihoken/wc-photos/13206_99_10_002_01_1.jpg,http://www.opendata.metro.tokyo.jp/fukushihoken/wc-photos/13206_99_10_002_01_2.jpg,http://www.opendata.metro.tokyo.jp/fukushihoken/wc-photos/13206_99_10_002_01_3.jpg,,�ߘa3�N7������
�g�C���o���A�t���[�f�[�^,�{���s���S�g��Q�ҕ����Z���^�[,�{���s�쒬�ܒ���38�Ԓn,�{���s���S�g��Q�ҕ����Z���^�[,�Q�K���ِ����g��g�C��,2F,139.466818,35.65616997,���p,��,�~,A.���������ˁi�����{�^���j,��,��,�~,��,�~,�~,�~,�~,�~,��,��,0900_1700,0900_1900,0900_1700,0900_1900,0900_1700,,,,,,,,,,,,,,,,,,,,,,,,http://www.opendata.metro.tokyo.jp/fukushihoken/wc-photos/13206_99_10_002_07_1.jpg,http://www.opendata.metro.tokyo.jp/fukushihoken/wc-photos/13206_99_10_002_07_2.jpg,http://www.opendata.metro.tokyo.jp/fukushihoken/wc-photos/13206_99_10_002_07_3.jpg,,�ߘa3�N7������
�g�C���o���A�t���[�f�[�^,�{���s���S�g��Q�ҕ����Z���^�[,�{���s�쒬�ܒ���38�Ԓn,�{���s���S�g��Q�ҕ����Z���^�[,�P�K�ی쎺�Q�g��g�C��,1F,139.466912,35.65626298,���p,�~,�~,A.���������ˁi�����{�^���j,��,��,��,��,�~,�~,�~,�~,�~,��,��,0900_1700,0900_1700,0900_1700,0900_1700,0900_1700,,,,��{�ً͋}�ꎞ�ی쎺���p�҂��g�p����,,,,,,,,,,,,,,,,,,,,http://www.opendata.metro.tokyo.jp/fukushihoken/wc-photos/13206_99_10_002_04_1.jpg,http://www.opendata.metro.tokyo.jp/fukushihoken/wc-photos/13206_99_10_002_04_2.jpg,http://www.opendata.metro.tokyo.jp/fukushihoken/wc-photos/13206_99_10_002_04_3.jpg,,�ߘa3�N7������
�g�C���o���A�t���[�f�[�^,�{���s���S�g��Q�ҕ����Z���^�[,�{���s�쒬�ܒ���38�Ԓn,�{���s���S�g��Q�ҕ����Z���^�[,�Q�K�V�ْ����g��g�C��,2F,139.4667865,35.65633012,���p,��,�~,A.���������ˁi�����{�^���j,��,��,�~,��,�~,�~,�~,�~,�~,��,��,0900_1700,0900_1900,0900_1700,0900_1900,0900_1700,,,,,,,,,,,,,,,,,,,,,,,,http://www.opendata.metro.tokyo.jp/fukushihoken/wc-photos/13206_99_10_002_10_1.jpg,http://www.opendata.metro.tokyo.jp/fukushihoken/wc-photos/13206_99_10_002_10_2.jpg,http://www.opendata.metro.tokyo.jp/fukushihoken/wc-photos/13206_99_10_002_10_3.jpg,,�ߘa3�N7������
�g�C���o���A�t���[�f�[�^,�{���s���S�g��Q�ҕ����Z���^�[,�{���s�쒬�ܒ���38�Ԓn,�{���s���S�g��Q�ҕ����Z���^�[,�Q�K�V�ِ����g��g�C��,2F,139.4666611,35.65638255,���p,��,�~,A.���������ˁi�����{�^���j,��,��,�~,��,�~,�~,��,�~,�~,��,��,0900_1700,0900_1900,0900_1700,0900_1900,0900_1700,,,,,,,,,,,,,,,,,,,,,,,,http://www.opendata.metro.tokyo.jp/fukushihoken/wc-photos/13206_99_10_002_09_1.jpg,http://www.opendata.metro.tokyo.jp/fukushihoken/wc-photos/13206_99_10_002_09_2.jpg,http://www.opendata.metro.tokyo.jp/fukushihoken/wc-photos/13206_99_10_002_09_3.jpg,,�ߘa3�N7������
�g�C���o���A�t���[�f�[�^,�{���s���S�g��Q�ҕ����Z���^�[,�{���s�쒬�ܒ���38�Ԓn,�{���s���S�g��Q�ҕ����Z���^�[,�Q�K�V�ٓ����g��g�C��,2F,139.467039,35.65621097,���p,��,�~,A.���������ˁi�����{�^���j,��,��,�~,��,�~,�~,��,�~,�~,��,��,0900_1700,0900_1900,0900_1700,0900_1900,0900_1700,,,,,,,,,,,,,,,,,,,,,,,,http://www.opendata.metro.tokyo.jp/fukushihoken/wc-photos/13206_99_10_002_11_1.jpg,http://www.opendata.metro.tokyo.jp/fukushihoken/wc-photos/13206_99_10_002_11_2.jpg,http://www.opendata.metro.tokyo.jp/fukushihoken/wc-photos/13206_99_10_002_11_3.jpg,,�ߘa3�N7������
�g�C���o���A�t���[�f�[�^,�{���s���S�g��Q�ҕ����Z���^�[,�{���s�쒬�ܒ���38�Ԓn,�{���s���S�g��Q�ҕ����Z���^�[,�P�K�ی쎺�P�g��g�C��,1F,139.4671496,35.6561747,���p,�~,�~,A.���������ˁi�����{�^���j,��,��,��,��,�~,�~,�~,�~,�~,��,��,0900_1700,0900_1700,0900_1700,0900_1700,0900_1700,,,,��{�ً͋}�ꎞ�ی쎺���p�҂��g�p����,,,,,,,,,,,,,,,,,,,,http://www.opendata.metro.tokyo.jp/fukushihoken/wc-photos/13206_99_10_002_03_1.jpg,http://www.opendata.metro.tokyo.jp/fukushihoken/wc-photos/13206_99_10_002_03_2.jpg,http://www.opendata.metro.tokyo.jp/fukushihoken/wc-photos/13206_99_10_002_03_3.jpg,,�ߘa3�N7������
�g�C���o���A�t���[�f�[�^,�{���s���y�̐X������,�{���s�쒬�Z����32�Ԓn,,�P�K�~���[�W�A���V���b�v������ł��g�C��,1F,139.4732278,35.65653617,���p,�~,�~,A.���������ˁi�����{�^���j,��,��,�~,��,�~,�~,��,�~,�~,��,��,,0900_1700,0900_1700,0900_1700,0900_1700,0900_1700,0900_1700,0900_1700,���j�����x���ɓ�����ꍇ�͗������x�قƂȂ邽�ߗ��p�ł��Ȃ��ق��A�Վ��x�ٓ��̍ۂ͗��p�ł��Ȃ��B,,,,,,,,,,,,,,,,,,,,http://www.opendata.metro.tokyo.jp/fukushihoken/wc-photos/13206_99_05_002_02_1.jpg,http://www.opendata.metro.tokyo.jp/fukushihoken/wc-photos/13206_99_05_002_02_2.jpg,http://www.opendata.metro.tokyo.jp/fukushihoken/wc-photos/13206_99_05_002_02_3.jpg,,�ߘa3�N7������
�g�C���o���A�t���[�f�[�^,�{���s���y�̐X������,�{���s�쒬�Z����32�Ԓn,,�P�K�v���l�^���E��������ł��g�C��,1F,139.4733706,35.65666069,���p,�~,�~,A.���������ˁi�����{�^���j,��,��,�~,��,�~,�~,��,�~,�~,��,��,,0900_1700,0900_1700,0900_1700,0900_1700,0900_1700,0900_1700,0900_1700,���j�����x���ɓ�����ꍇ�͗������x�قƂȂ邽�ߗ��p�ł��Ȃ��ق��A�Վ��x�ٓ��̍ۂ͗��p�ł��Ȃ��B,,,,,,,,,,,,,,,,,,,,http://www.opendata.metro.tokyo.jp/fukushihoken/wc-photos/13206_99_05_002_01_1.jpg,http://www.opendata.metro.tokyo.jp/fukushihoken/wc-photos/13206_99_05_002_01_2.jpg,http://www.opendata.metro.tokyo.jp/fukushihoken/wc-photos/13206_99_05_002_01_3.jpg,,�ߘa3�N7������
�g�C���o���A�t���[�f�[�^,���͌��Γ�,�{���s��蒬�O����10�Ԓn�t��,,���͌��Γ�����ł��g�C��,1F,139.473268,35.66030897,���p,�~,�~,D.�蓮�J����,��,�~,�~,��,�~,�~,�~,�~,�~,��,��,0000_2359,0000_2359,0000_2359,0000_2359,0000_2359,0000_2359,0000_2359,0000_2359,,,,,,,,,,,,,,,,,,,,,http://www.opendata.metro.tokyo.jp/fukushihoken/wc-photos/13206_99_07_006_01_1.jpg,http://www.opendata.metro.tokyo.jp/fukushihoken/wc-photos/13206_99_07_006_01_2.jpg,,,�ߘa3�N7������